{"text_format":"1","workbook":"xlsx","n_sheets":20,"sheets":["Totals","Launch Box","Client Info Box","Print Sheets","Travel","Calendar","Job Report","Top Sheet","Page 1A","Page 1B","Page 2","Page 3","Page 4","Page 5","Page 6","Sales Log","Purchase Order Log","Petty Cash Log","Payroll Log","Check Log"],"not_rendered":{"charts":0,"images":0,"macros":1,"external_links":0,"defined_names":492,"comments":0,"pivot_tables":0},"unopened":[],"bounds":{"document_bytes":16777216,"sheet_cells":100000,"rows_first":2000,"rows_last":500,"rows_between":2000,"halvings":0,"cell_chars":16384,"cell_head_chars":4096},"cells_cut":0,"cells_raw":0,"read":"whole","date_system":"1900"}

{"sheet":"Totals","index":0,"n_rows":359,"n_cols":28,"rows_kept":359,"cut":false,"hidden":true,"merged":[]}
[null,1.0,{"$f":"IF('Page 1A'!B7=\"\",\"LINE DESCRIPTION?\",'Page 1A'!B7)","v":"Line Producer"},{"$f":"SUMIF(PAYROLLLINE,B1:B50,PAYROLLAMOUNT)","v":0},{"$f":"IF(D1:D50=0,0,SUMIF(PAYROLLLINE,B1:B50,PAYROLLST)/D1:D50)","v":0},{"$f":"SUMIF(PAYROLLLINE,B1:B50,PAYROLLOTHRS)","v":0},{"$f":"SUMIF(PAYROLLLINE,B1:B50,PAYROLLST)","v":0},{"$f":"SUMIF(PAYROLLLINE,B1:B50,PAYROLLOT)","v":0},{"$f":"SUMIF(PAYROLLLINE,B1:B50,PAYROLLMISCT)+SUMIF(PAYROLLLINE,B1:B50,PAYROLLMISCNT)","v":0},{"$f":"SUMIF(POLINE,B1:B50,POACTUAL)-SUMIF(REFUNDSLINE,B1:B50,REFUNDSACTUAL)+SUMIF(PCLINE,B1:B50,PCACTUAL)","v":0},{"$f":"SUMIF(POLINE,B1:B50,POACTUAL)-SUMIF(REFUNDSLINE,B1:B50,REFUNDSACTUAL)+SUMIF(PAYROLLLINE,B1:B50,PAYROLLACTUAL)+SUMIF(PCLINE,B1:B50,PCACTUAL)","v":0},null,null,null,null,null,null,null,"Record Label:"]
[null,2.0,{"$f":"IF('Page 1A'!B8=\"\",\"LINE DESCRIPTION?\",'Page 1A'!B8)","v":"Assistant Director"},0.0,0.0,0.0,0.0,0.0,0.0,0.0,0.0,null,null,null,null,null,null,null,"Address:"]
[null,3.0,{"$f":"IF('Page 1A'!B9=\"\",\"LINE DESCRIPTION?\",'Page 1A'!B9)","v":"Director of Photography"},0.0,0.0,0.0,0.0,0.0,0.0,0.0,0.0]
[null,4.0,{"$f":"IF('Page 1A'!B10=\"\",\"LINE DESCRIPTION?\",'Page 1A'!B10)","v":"Camera Operator"},0.0,0.0,0.0,0.0,0.0,0.0,0.0,0.0,null,null,null,null,null,null,null,"Telephone:"]
[null,5.0,{"$f":"IF('Page 1A'!B11=\"\",\"LINE DESCRIPTION?\",'Page 1A'!B11)","v":"1st Camera Assistant"},0.0,0.0,0.0,0.0,0.0,0.0,0.0,0.0,null,null,null,null,null,null,null,"Fax:"]
[null,6.0,{"$f":"IF('Page 1A'!B12=\"\",\"LINE DESCRIPTION?\",'Page 1A'!B12)","v":"2nd AC"},0.0,0.0,0.0,0.0,0.0,0.0,0.0,0.0,null,null,null,null,null,null,null,"Contacts:"]
[null,7.0,{"$f":"IF('Page 1A'!B13=\"\",\"LINE DESCRIPTION?\",'Page 1A'!B13)","v":"Loader"},0.0,0.0,0.0,0.0,0.0,0.0,0.0,0.0]
[null,8.0,{"$f":"IF('Page 1A'!B14=\"\",\"LINE DESCRIPTION?\",'Page 1A'!B14)","v":"Production Manager"},0.0,0.0,0.0,0.0,0.0,0.0,0.0,0.0,null,null,null,null,null,null,null,"Artist:"]
{"$rows_left_out":352}
{"sheet":"Launch Box","index":1,"n_rows":0,"n_cols":0,"rows_kept":0,"cut":false,"hidden":true,"merged":[]}

{"sheet":"Client Info Box","index":2,"n_rows":0,"n_cols":0,"rows_kept":0,"cut":false,"hidden":true,"merged":[]}

{"sheet":"Print Sheets","index":3,"n_rows":0,"n_cols":0,"rows_kept":0,"cut":false,"hidden":true,"merged":[]}

{"sheet":"Travel","index":4,"n_rows":87,"n_cols":35,"rows_kept":87,"cut":false,"hidden":false,"merged":[[1,1,1,2],[5,25,5,26],[5,27,5,28],[5,29,5,30]]}
[]
[null,"TYPE OF DAY"]
[null,"T = Travel / P = Prep / TS = Tech Scout / D = Down"]
[null,"B = Build / PL = Pre-light / S = Shoot / W = Wrap"]
[]
[null,null,null,"Tue","Wed","Thu","Fri","Sat","Sun","Mon","Tue","Wed","Thu","Fri","Sat","Sun","Mon","Tue","Wed","Thu","Fri","Sat","Sun","Mon","TOTAL","Car Rentals",null,"Travel Fares",null,"Hotels/Per Diem",null,"TOTAL","TOTAL","TOTAL"]
[null,"Name","Title","2000-02-01","2000-02-02","2000-02-03","2000-02-04","2000-02-05","2000-02-06","2000-02-07","2000-02-08","2000-02-09","2000-02-10","2000-02-11","2000-02-12","2000-02-13","2000-02-14","2000-02-15","2000-02-16","2000-02-17","2000-02-18","2000-02-19","2000-02-20","2000-02-21","DAYS","No.","Cost","No.","Cost","No.","Cost","Car","Fare","Hotel/PD"]
[null,null,"Director",null,null,null,null,null,null,null,null,null,null,null,null,null,null,null,null,null,null,null,null,null,{"$f":"COUNTA(D8:X8)","v":0},1.0,500.0,null,null,null,null,{"$f":"Z8*AA8","v":500},{"$f":"AB8*AC8","v":0},{"$f":"AD8*AE8","v":0}]
{"$rows_left_out":80}
{"sheet":"Calendar","index":5,"n_rows":45,"n_cols":16,"rows_kept":45,"cut":false,"hidden":false,"merged":[[1,1,1,7],[1,9,1,15]]}
[]
[null,"NOVEMBER",null,null,null,null,null,null,null,"DECEMBER"]
[]
[null,"SUNDAY","MONDAY","TUESDAY","WEDNESDAY","THURSDAY","FRIDAY","SATURDAY",null,"SUNDAY","MONDAY","TUESDAY","WEDNESDAY","THURSDAY","FRIDAY","SATURDAY"]
[null,"2000-10-29","2000-10-30","2000-10-31","2000-11-01","2000-11-02","2000-11-03","2000-11-04",null,"2000-11-26","2000-11-27","2000-11-28","2000-11-29","2000-11-30","2000-12-01","2000-12-02"]
[]
[]
[]
{"$rows_left_out":38}
{"sheet":"Job Report","index":6,"n_rows":60,"n_cols":13,"rows_kept":60,"cut":false,"hidden":false,"merged":[[43,2,43,8],[53,1,53,4],[53,6,53,10],[58,6,58,10],[59,6,59,10],[1,1,1,10],[7,1,7,10],[12,1,12,10],[17,1,17,10],[35,1,35,10],[36,1,36,10],[41,1,41,10]]}
[null,null,null,null,null,null,null,null,null,null,null,null,""]
[null,"J O B  R E P O R T"]
[null,{"$f":"IF('Top Sheet'!C5=\"\",\"\",'Top Sheet'!C5)","v":""}]
[null,{"$f":"IF('Top Sheet'!$G$5=\"Agency:\",IF('Top Sheet'!$L$15=\"\",\"\",'Top Sheet'!$L$15),IF('Top Sheet'!$L$12=\"\",\"\",'Top Sheet'!$L$12))","v":""}]
[null,{"$f":"IF('Top Sheet'!$G$5=\"Agency:\",IF('Top Sheet'!$L$16=\"\",\"\",'Top Sheet'!$L$16),IF('Top Sheet'!$L$13=\"\",\"\",'Top Sheet'!$L$13))","v":""}]
[null,{"$f":"IF('Top Sheet'!$C$10=\"\",\"\",\"Job #: \"&'Top Sheet'!$C$10)","v":""}]
[]
[null,"RECONCILIATION"]
{"$rows_left_out":53}
{"sheet":"Top Sheet","index":7,"n_rows":62,"n_cols":16,"rows_kept":62,"cut":false,"hidden":false,"merged":[[1,0,1,15],[2,0,2,15]]}
[]
["ASSOCIATION OF INDEPENDENT COMMERCIAL PRODUCERS"]
["FILM PRODUCTION COST SUMMARY"]
[null,"Bid Date:",{"$f":"TODAY()","v":"2023-05-22"}]
[null,"Production Co.:",null,null,null,null,"Agency:"]
[null,"Address:",null,null,null,null,"Address:"]
[]
[null,"Telephone:",null,null,null,null,"Telephone:"]
{"$rows_left_out":55}
{"sheet":"Page 1A","index":8,"n_rows":59,"n_cols":38,"rows_kept":59,"cut":false,"hidden":false,"merged":[[3,31,3,36],[4,8,4,9],[4,18,4,19],[4,22,4,24],[4,34,4,35]]}
[]
[{"$f":"IF('Top Sheet'!$C$5=\"\",\"\",'Top Sheet'!$C$5)","v":""},null,null,null,null,null,null,null,null,null,null,null,null,null,null,null,null,null,null,null,"Page 1A",null,null,null,null,null,null,null,null,"Page 1A"]
[{"$f":"IF('Top Sheet'!$G$5=\"Agency:\",IF('Top Sheet'!$L$15=\"\",\"\",'Top Sheet'!$L$15),IF('Top Sheet'!$L$12=\"\",\"\",'Top Sheet'!$L$12))","v":""}]
[{"$f":"IF('Top Sheet'!$G$5=\"Agency:\",IF('Top Sheet'!$L$16=\"\",\"\",'Top Sheet'!$L$16),IF('Top Sheet'!$L$13=\"\",\"\",'Top Sheet'!$L$13))","v":""},null,null,null,null,null,null,null,null,null,null,null,null,null,null,null,null,null,null,null,null,null,null,null,null,null,null,null,null,null,null,"OVERTIME CALCULATOR"]
[null,"PRE-PRO & WRAP",null,null,"%","OT",null,null,"OT Hours",null,"Rate",null,null,null,"%","OT",null,null,"OT Hours",null,null,null,"Payroll Log Detail",null,null,null,"Payroll Log Costs",null,"Other",null,null,"%","OT",null,"OT Hours",null,"OVERTIME"]
["A","CREW",null,"Notes","PT/P&W","Based","Days","Rate",1.5,2.0,"Change","ESTIMATED","PT/P&W",null,"PT/P&W","Based","Days","Rate",{"$f":"I6","v":1.5},2,"WORKING","PT/P&W","Days","Rate","OT Hrs","Misc","ST","OT","Logs","ACTUAL",null,"PT/P&W","Based","Rate",1.5,2.0,"TOTAL"]
[1.0,"Line Producer",null,null,29.0,10.0,null,1200.0,null,null,{"$f":"H7:H56*X_RATE","v":1200},{"$f":"ROUND((G7:G56*H7:H56)+(H7:H56/F7:F56*$I$6*I7:I56)+(H7:H56/F7:F56*$J$6*J7:J56),0)","v":0},{"$f":"ROUND(L7:L56*E7:E56/100,2)","v":0},null,{"$f":"E7","v":29},10,"",1200,"","",{"$f":"ROUND((Q7:Q56*R7:R56)+(R7:R56/P7:P56*$I$6*S7:S56)+(R7:R56/P7:P56*$J$6*T7:T56),2)","v":0},{"$f":"ROUND(U7:U56*O7:O56/100,2)","v":0},0.0,0.0,0.0,0.0,0.0,0.0,0.0,0.0,null,{"$f":"O7","v":29},10,{"$f":"R7","v":1200},null,null,{"$f":"IF(AG7:AG56=0,0,ROUND((AH7:AH56/AG7:AG56*$AI$6*AI7:AI56)+(AH7:AH56/AG7:AG56*$AJ$6*AJ7:AJ56),2))","v":0},{"$f":"ROUND(AK7:AK56*AF7:AF56/100,2)","v":0}]
[2.0,"Assistant Director",null,null,43.0,12.0,null,1200.0,null,null,1200.0,0,0.0,null,{"$f":"E8","v":43},12,"",1200,"","",0.0,0.0,0.0,0.0,0.0,0.0,0.0,0.0,0.0,0.0,null,{"$f":"O8","v":43},12,1200,null,null,0.0,0.0]
{"$rows_left_out":52}
{"sheet":"Page 1B","index":9,"n_rows":59,"n_cols":38,"rows_kept":59,"cut":false,"hidden":false,"merged":[[3,31,3,36],[4,8,4,9],[4,18,4,19],[4,22,4,24],[4,25,4,27],[4,34,4,35]]}
[]
[{"$f":"IF('Top Sheet'!$C$5=\"\",\"\",'Top Sheet'!$C$5)","v":""},null,null,null,null,null,null,null,null,null,null,null,null,null,null,null,null,null,null,null,"Page 1B",null,null,null,null,null,null,null,null,"Page 1B"]
[{"$f":"IF('Top Sheet'!$G$5=\"Agency:\",IF('Top Sheet'!$L$15=\"\",\"\",'Top Sheet'!$L$15),IF('Top Sheet'!$L$12=\"\",\"\",'Top Sheet'!$L$12))","v":""}]
[{"$f":"IF('Top Sheet'!$G$5=\"Agency:\",IF('Top Sheet'!$L$16=\"\",\"\",'Top Sheet'!$L$16),IF('Top Sheet'!$L$13=\"\",\"\",'Top Sheet'!$L$13))","v":""},null,null,null,null,null,null,null,null,null,null,null,null,null,null,null,null,null,null,null,null,null,null,null,null,null,null,null,null,null,null,"OVERTIME CALCULATOR"]
[null,"SHOOTING",null,null,"%","OT",null,null,"OT Hours",null,"Rate",null,null,null,"%","OT",null,null,"OT Hours",null,null,null,"Payroll Log Detail",null,null,"Payroll Log Costs",null,null,"Other",null,null,"%","OT",null,"OT Hours",null,"OVERTIME"]
["B","CREW",null,"Notes","PT/P&W","Based","Days","Rate",1.5,2.0,"Change","ESTIMATED","PT/P&W",null,"PT/P&W","Based","Days","Rate",{"$f":"I6","v":1.5},2,"WORKING","PT/P&W","Days","Rate","OT Hrs","Misc","ST","OT","Logs","ACTUAL",null,"PT/P&W","Based","Rate",1.5,2.0,"TOTAL"]
[51.0,{"$f":"'Page 1A'!B7","v":"Line Producer"},null,null,{"$f":"'Page 1A'!E7","v":29},10.0,null,{"$f":"'Page 1A'!H7","v":1200},null,null,{"$f":"H7:H56*X_RATE","v":1200},{"$f":"ROUND((G7:G56*H7:H56)+(H7:H56/F7:F56*$I$6*I7:I56)+(H7:H56/F7:F56*$J$6*J7:J56),0)","v":0},{"$f":"ROUND(L7:L56*E7:E56/100,0)","v":0},null,{"$f":"E7","v":29},10,"",1200,"","",{"$f":"ROUND((Q7:Q56*R7:R56)+(R7:R56/P7:P56*$S$6*S7:S56)+(R7:R56/P7:P56*$T$6*T7:T56),2)","v":0},{"$f":"ROUND(U7:U56*O7:O56/100,2)","v":0},0.0,0.0,0.0,0.0,0.0,0.0,0.0,0.0,null,{"$f":"O7","v":29},10,{"$f":"R7","v":1200},null,null,{"$f":"IF(AG7:AG56=0,0,ROUND((AH7:AH56/AG7:AG56*$AI$6*AI7:AI56)+(AH7:AH56/AG7:AG56*$AJ$6*AJ7:AJ56),2))","v":0},{"$f":"ROUND(AK7:AK56*AF7:AF56/100,2)","v":0}]
[52.0,{"$f":"'Page 1A'!B8","v":"Assistant Director"},null,null,{"$f":"'Page 1A'!E8","v":43},12.0,null,{"$f":"'Page 1A'!H8","v":1200},null,null,1200.0,0.0,0.0,null,{"$f":"E8","v":43},12,"",1200,"","",0.0,0.0,0.0,0.0,0.0,0.0,0.0,0.0,0.0,0.0,null,{"$f":"O8","v":43},12,1200,null,null,0.0,0.0]
{"$rows_left_out":52}
{"sheet":"Page 2","index":10,"n_rows":63,"n_cols":14,"rows_kept":63,"cut":false,"hidden":false,"merged":[]}
[]
[{"$f":"IF('Top Sheet'!$C$5=\"\",\"\",'Top Sheet'!$C$5)","v":""},null,null,null,null,null,null,null,null,null,null,null,"Page 2","Page 2"]
[{"$f":"IF('Top Sheet'!$G$5=\"Agency:\",IF('Top Sheet'!$L$15=\"\",\"\",'Top Sheet'!$L$15),IF('Top Sheet'!$L$12=\"\",\"\",'Top Sheet'!$L$12))","v":""}]
[{"$f":"IF('Top Sheet'!$G$5=\"Agency:\",IF('Top Sheet'!$L$16=\"\",\"\",'Top Sheet'!$L$16),IF('Top Sheet'!$L$13=\"\",\"\",'Top Sheet'!$L$13))","v":""}]
["C","PRE-PRODUCTION & WRAP EXPENSES",null,"Amount","Rate","x","R/C","ESTIMATED",null,"Amount","Rate","x","WORKING","ACTUAL"]
[101.0,"Auto/Passenger Van Rentals",null,null,150.0,null,{"$f":"E6:E18*X_RATE","v":150},{"$f":"ROUND(D6:D18*E6:E18*IF(F6:F18=0,1,F6:F18),0)","v":0},null,{"$f":"D6","v":""},150,"",{"$f":"ROUND(J6:J18*K6:K18*IF(L6:L18=0,1,L6:L18),2)","v":0},0.0]
[102.0,"Air Fares",null,null,0.0,null,0.0,0.0,null,{"$f":"D7","v":""},0,"",0.0,0.0]
[103.0,"Per Diems",null,null,null,null,0.0,0.0,null,{"$f":"D8","v":""},"","",0.0,0.0]
{"$rows_left_out":56}
{"sheet":"Page 3","index":11,"n_rows":61,"n_cols":38,"rows_kept":61,"cut":false,"hidden":false,"merged":[[24,31,24,36],[25,8,25,10],[25,18,25,19],[25,22,25,24],[25,25,25,27],[25,34,25,35]]}
[]
[{"$f":"IF('Top Sheet'!$C$5=\"\",\"\",'Top Sheet'!$C$5)","v":""},null,null,null,null,null,null,null,null,null,null,null,null,null,null,null,null,null,null,null,"Page 3",null,null,null,null,null,null,null,null,"Page 3"]
[{"$f":"IF('Top Sheet'!$G$5=\"Agency:\",IF('Top Sheet'!$L$15=\"\",\"\",'Top Sheet'!$L$15),IF('Top Sheet'!$L$12=\"\",\"\",'Top Sheet'!$L$12))","v":""}]
[{"$f":"IF('Top Sheet'!$G$5=\"Agency:\",IF('Top Sheet'!$L$16=\"\",\"\",'Top Sheet'!$L$16),IF('Top Sheet'!$L$13=\"\",\"\",'Top Sheet'!$L$13))","v":""}]
["F","STUDIO RENTAL & EXPENSES",null,null,null,null,null,"Amount","Rate","x","R/C","ESTIMATED",null,null,null,null,null,"Amount","Rate","x","WORKING",null,null,null,null,null,null,null,null,"ACTUAL"]
[151.0,"Rental for Build",null,null,null,null,null,null,null,null,{"$f":"I6:I22*X_RATE","v":0},{"$f":"ROUND(H6:H22*I6:I22*IF(J6:J22=0,1,J6:J22),0)","v":0},null,null,null,null,null,{"$f":"H6","v":""},"","",{"$f":"ROUND(R6:R22*S6:S22*IF(T6:T22=0,1,T6:T22),2)","v":0},null,null,null,null,null,null,null,null,0.0]
[152.0,"Build OT Hours",null,null,null,null,null,null,null,null,0.0,0.0,null,null,null,null,null,{"$f":"H7","v":""},"","",0.0,null,null,null,null,null,null,null,null,0.0]
[153.0,"Rental for Pre-Lite Days",null,null,null,null,null,null,null,null,0.0,0.0,null,null,null,null,null,null,null,{"$f":"J8","v":""},0.0,null,null,null,null,null,null,null,null,0.0]
{"$rows_left_out":54}
{"sheet":"Page 4","index":12,"n_rows":61,"n_cols":16,"rows_kept":61,"cut":false,"hidden":false,"merged":[]}
[]
[{"$f":"IF('Top Sheet'!$C$5=\"\",\"\",'Top Sheet'!$C$5)","v":""},null,null,null,null,null,null,null,null,null,null,null,null,null,"Page 4","Page 4"]
[{"$f":"IF('Top Sheet'!$G$5=\"Agency:\",IF('Top Sheet'!$L$15=\"\",\"\",'Top Sheet'!$L$15),IF('Top Sheet'!$L$12=\"\",\"\",'Top Sheet'!$L$12))","v":""}]
[{"$f":"IF('Top Sheet'!$G$5=\"Agency:\",IF('Top Sheet'!$L$16=\"\",\"\",'Top Sheet'!$L$16),IF('Top Sheet'!$L$13=\"\",\"\",'Top Sheet'!$L$13))","v":""}]
["I","EQUIPMENT RENTAL",null,null,"Amount","Rate","x","R/C","ESTIMATED",null,null,"Amount","Rate","x","WORKING","ACTUAL"]
[193.0,"Camera Rental",null,null,null,5500.0,1.0,{"$f":"F6:F23*X_RATE","v":5500},{"$f":"ROUND(E6:E23*F6:F23*IF(G6:G23=0,1,G6:G23),0)","v":0},null,null,{"$f":"E6","v":""},5500,1,{"$f":"ROUND(L6:L23*M6:M23*IF(N6:N23=0,1,N6:N23),2)","v":0},0.0]
[194.0,"Sound Rental",null,null,null,850.0,1.0,850.0,0.0,null,null,{"$f":"E7","v":""},850,1,0.0,0.0]
[195.0,"Lighting Rental",null,null,null,7000.0,1.0,7000.0,0.0,null,null,{"$f":"E8","v":""},7000,1,0.0,0.0]
{"$rows_left_out":54}
{"sheet":"Page 5","index":13,"n_rows":58,"n_cols":42,"rows_kept":58,"cut":false,"hidden":false,"merged":[[3,35,3,40],[4,10,4,11],[4,22,4,23],[4,26,4,28],[4,29,4,31],[4,38,4,39]]}
[]
[{"$f":"IF('Top Sheet'!$C$5=\"\",\"\",'Top Sheet'!$C$5)","v":""},null,null,null,null,null,null,null,null,null,null,null,null,null,null,null,null,null,null,null,null,null,null,null,"Page 5",null,null,null,null,null,null,null,null,"Page 5"]
[{"$f":"IF('Top Sheet'!$G$5=\"Agency:\",IF('Top Sheet'!$L$15=\"\",\"\",'Top Sheet'!$L$15),IF('Top Sheet'!$L$12=\"\",\"\",'Top Sheet'!$L$12))","v":""}]
[{"$f":"IF('Top Sheet'!$G$5=\"Agency:\",IF('Top Sheet'!$L$16=\"\",\"\",'Top Sheet'!$L$16),IF('Top Sheet'!$L$13=\"\",\"\",'Top Sheet'!$L$13))","v":""},null,null,null,null,null,null,null,null,null,null,null,null,null,null,null,null,null,null,null,null,null,null,null,null,null,null,null,null,null,null,null,null,null,null,"OVERTIME CALCULATOR"]
[null,"Talent",null,null,"%","OT",null,"Travel","Shoot",null,"OT Hours",null,"Rate",null,null,null,"%","OT",null,"Travel","Shoot",null,"OT Hours",null,null,null,"Payroll Log Detail",null,null,"Payroll Log Costs",null,null,"Other",null,null,"%","OT",null,"OT Hours",null,"OVERTIME"]
["M",null,null,"Notes","PT/P&W","Based","No.","Days","Days","Rate",1.5,2.0,"Change","ESTIMATED","PT/P&W",null,"PT/P&W","Based","No.","Days","Days","Rate",{"$f":"K6","v":1.5},2,"WORKING","PT/P&W","Days","Rate","OT Hrs","Misc","ST","OT","Logs","ACTUAL",null,"PT/P&W","Based","Rate",1.5,2.0,"TOTAL"]
[234.0,"O/C Principals",null,null,20.0,8.0,null,null,null,null,null,null,{"$f":"J7:J38*X_RATE","v":0},{"$f":"ROUND(G7:G38*(((I7:I38+H7:H38)*J7:J38)+(J7:J38/F7:F38*$K$6*K7:K38)+(J7:J38/F7:F38*$L$6*L7:L38)),0)","v":0},{"$f":"ROUND(N7:N38*E7:E38/100,0)","v":0},null,{"$f":"E7","v":20},8,"","","","","","",{"$f":"ROUND(S7:S38*(((U7:U38+T7:T38)*V7:V38)+(V7:V38/R7:R38*$W$6*W7:W38)+(V7:V38/R7:R38*$X$6*X7:X38)),2)","v":0},{"$f":"ROUND(Y7:Y38*Q7:Q38/100,2)","v":0},0.0,0.0,0.0,0.0,0.0,0.0,0.0,0.0,null,{"$f":"Q7","v":20},8,{"$f":"V7","v":""},null,null,{"$f":"IF(AK7:AK38=0,0,ROUND((AL7:AL38/AK7:AK38*$AM$6*AM7:AM38)+(AL7:AL38/AK7:AK38*$AN$6*AN7:AN38),2))","v":0},{"$f":"ROUND(AO7:AO38*AJ7:AJ38/100,2)","v":0}]
[235.0,"O/C Principals",null,null,20.0,8.0,null,null,null,null,null,null,0.0,0.0,0.0,null,{"$f":"E8","v":20},8,"","","","","","",0.0,0.0,0.0,0.0,0.0,0.0,0.0,0.0,0.0,0.0,null,{"$f":"Q8","v":20},8,"",null,null,0.0,0.0]
{"$rows_left_out":51}
{"sheet":"Page 6","index":14,"n_rows":64,"n_cols":16,"rows_kept":64,"cut":false,"hidden":false,"merged":[]}
[]
[{"$f":"IF('Top Sheet'!$C$5=\"\",\"\",'Top Sheet'!$C$5)","v":""},null,null,null,null,null,null,null,null,null,null,null,null,null,"Page 6","Page 6"]
[{"$f":"IF('Top Sheet'!$G$5=\"Agency:\",IF('Top Sheet'!$L$15=\"\",\"\",'Top Sheet'!$L$15),IF('Top Sheet'!$L$12=\"\",\"\",'Top Sheet'!$L$12))","v":""}]
[{"$f":"IF('Top Sheet'!$G$5=\"Agency:\",IF('Top Sheet'!$L$16=\"\",\"\",'Top Sheet'!$L$16),IF('Top Sheet'!$L$13=\"\",\"\",'Top Sheet'!$L$13))","v":""},null,null,"%"]
["O","OFF-LINE ",null,"PT/P&W","Amount","Rate","x","R/C","ESTIMATED","PT/P&W",null,"Amount","Rate","x","WORKING","ACTUAL"]
[277.0,"Post Supervisor",null,20.0,null,650.0,null,{"$f":"F6:F10*X_RATE","v":650},{"$f":"ROUND(E6:E10*F6:F10*IF(G6:G10=0,1,G6:G10),0)","v":0},{"$f":"ROUND(I6:I10*D6:D10/100,0)","v":0},null,{"$f":"E6","v":""},650,"",{"$f":"ROUND(L6:L10*M6:M10*IF(N6:N10=0,1,N6:N10),2)","v":0},0.0]
[278.0,"Off-line Editor",null,20.0,null,2500.0,null,2500.0,0.0,0.0,null,{"$f":"E7","v":""},2500,"",0.0,0.0]
[279.0,"Assistant Editor",null,20.0,null,425.0,null,425.0,0.0,0.0,null,{"$f":"E8","v":""},425,"",0.0,0.0]
{"$rows_left_out":57}
{"sheet":"Sales Log","index":15,"n_rows":19,"n_cols":7,"rows_kept":19,"cut":false,"hidden":false,"merged":[[1,0,1,5]]}
[]
["SALES LOG"]
[{"$f":"IF('Top Sheet'!$G$5=\"Agency:\",IF('Top Sheet'!$L$15=\"\",\"\",'Top Sheet'!$L$15),IF('Top Sheet'!$L$12=\"\",\"\",'Top Sheet'!$L$12))","v":""}]
[{"$f":"IF('Top Sheet'!$G$5=\"Agency:\",IF('Top Sheet'!$L$16=\"\",\"\",'Top Sheet'!$L$16),IF('Top Sheet'!$L$13=\"\",\"\",'Top Sheet'!$L$13))","v":""}]
[{"$f":"IF('Top Sheet'!$C$10=\"\",\"\",\"Job #: \"&'Top Sheet'!$C$10)","v":""}]
[]
["Line","Payer","Notes","Receive ID","ACTUAL","Description","Row"]
[null,null,null,null,null,{"$f":"IF(A8=\"\",\"\",IF(AND(A8>0,A8<330),VLOOKUP(A8,Totals!$B$1:$C$359,2),\"LINE NUMBER?\"))","v":""},1.0]
{"$rows_left_out":12}
{"sheet":"Purchase Order Log","index":16,"n_rows":30,"n_cols":8,"rows_kept":30,"cut":false,"hidden":false,"merged":[[1,0,1,6]]}
[]
["PURCHASE ORDER LOG"]
[{"$f":"IF('Top Sheet'!$G$5=\"Agency:\",IF('Top Sheet'!$L$15=\"\",\"\",'Top Sheet'!$L$15),IF('Top Sheet'!$L$12=\"\",\"\",'Top Sheet'!$L$12))","v":""}]
[{"$f":"IF('Top Sheet'!$G$5=\"Agency:\",IF('Top Sheet'!$L$16=\"\",\"\",'Top Sheet'!$L$16),IF('Top Sheet'!$L$13=\"\",\"\",'Top Sheet'!$L$13))","v":""},null,"              ","           "]
[{"$f":"IF('Top Sheet'!$C$10=\"\",\"\",\"Job #: \"&'Top Sheet'!$C$10)","v":""},null,null,null,null,null," "]
[]
["Line","Payee","PO","Date","Pay ID","ACTUAL","Description","Row"]
[null,null,null,null,null,null,{"$f":"IF(A8=\"PC\",\"PETTY CASH LOG\",IF(A8=\"PR\",\"PAYROLL LOG\",IF(A8=\"\",\"\",IF(AND(A8>0,A8<330),VLOOKUP(A8,Totals!$B$1:$C$359,2),\"LINE NUMBER?\"))))","v":""},1.0]
{"$rows_left_out":23}
{"sheet":"Petty Cash Log","index":17,"n_rows":25,"n_cols":10,"rows_kept":25,"cut":false,"hidden":false,"merged":[[1,0,1,8],[5,1,5,6]]}
[]
["PETTY CASH LOG"]
[{"$f":"IF('Top Sheet'!$G$5=\"Agency:\",IF('Top Sheet'!$L$15=\"\",\"\",'Top Sheet'!$L$15),IF('Top Sheet'!$L$12=\"\",\"\",'Top Sheet'!$L$12))","v":""}]
[{"$f":"IF('Top Sheet'!$G$5=\"Agency:\",IF('Top Sheet'!$L$16=\"\",\"\",'Top Sheet'!$L$16),IF('Top Sheet'!$L$13=\"\",\"\",'Top Sheet'!$L$13))","v":""}]
[{"$f":"IF('Top Sheet'!$C$10=\"\",\"\",\"Job #: \"&'Top Sheet'!$C$10)","v":""}]
[null,"PC Envelopes"]
["Line","name?","name?","name?","name?","name?","name?","ACTUAL","Description","Row"]
[null,null,null,null,null,null,null,{"$f":"SUM(B8:G8)","v":0},{"$f":"IF(A8=0,\"\",IF(AND(A8>0,A8<330),VLOOKUP(A8,Totals!$B$1:$C$359,2),\"LINE NUMBER?\"))","v":""},1.0]
{"$rows_left_out":18}
{"sheet":"Payroll Log","index":18,"n_rows":33,"n_cols":19,"rows_kept":33,"cut":false,"hidden":false,"merged":[[1,0,1,17],[5,7,5,9]]}
[]
["PAYROLL LOG"]
[{"$f":"IF('Top Sheet'!$G$5=\"Agency:\",IF('Top Sheet'!$L$15=\"\",\"\",'Top Sheet'!$L$15),IF('Top Sheet'!$L$12=\"\",\"\",'Top Sheet'!$L$12))","v":""}]
[{"$f":"IF('Top Sheet'!$G$5=\"Agency:\",IF('Top Sheet'!$L$16=\"\",\"\",'Top Sheet'!$L$16),IF('Top Sheet'!$L$13=\"\",\"\",'Top Sheet'!$L$13))","v":""}]
[{"$f":"IF('Top Sheet'!$C$10=\"\",\"\",\"Job #: \"&'Top Sheet'!$C$10)","v":""}]
[null,null,null,"%","OT",null,null,"OT  Hours",null,null,"Misc","Misc"]
["Line","Payee","PO"," PT/P&W ","Based","Days","Rate",1.5,2.0,3.0,"Taxable","Non-taxable","Total ST","OT hrs","Total OT","ACTUAL","Description","PT/P&W","Row"]
[null,null,null,null,null,null,null,null,null,null,null,null,{"$f":"F8*G8","v":0},{"$f":"H8+I8+J8","v":0},{"$f":"ROUND(IF(E8>0,(G8/E8*$H$7*H8)+(G8/E8*$I$7*I8)+(G8/E8*$J$7*J8),0),2)","v":0},{"$f":"K8+L8+M8+O8","v":0},{"$f":"IF(A8=\"\",\"\",IF(AND(A8>0,A8<330),VLOOKUP(A8,Totals!$B$1:$C$359,2),\"LINE NUMBER?\"))","v":""},{"$f":"ROUND((K8+M8+O8)*D8/100,2)","v":0},1.0]
{"$rows_left_out":26}
{"sheet":"Check Log","index":19,"n_rows":14,"n_cols":8,"rows_kept":14,"cut":false,"hidden":false,"merged":[[1,0,1,6]]}
[]
["CHECK LOG"]
[{"$f":"IF('Top Sheet'!$G$5=\"Agency:\",IF('Top Sheet'!$L$15=\"\",\"\",'Top Sheet'!$L$15),IF('Top Sheet'!$L$12=\"\",\"\",'Top Sheet'!$L$12))","v":""}]
[{"$f":"IF('Top Sheet'!$G$5=\"Agency:\",IF('Top Sheet'!$L$16=\"\",\"\",'Top Sheet'!$L$16),IF('Top Sheet'!$L$13=\"\",\"\",'Top Sheet'!$L$13))","v":""},null,"              ","           "]
[{"$f":"IF('Top Sheet'!$C$10=\"\",\"\",\"Job #: \"&'Top Sheet'!$C$10)","v":""},null,null,null,null,null," "]
[]
["Line","Payee","Check ID","Date","PO","ACTUAL","Description","Row"]
[null,null,null,null,null,null,{"$f":"IF(A8=\"\",\"\",IF(AND(A8>0,A8<330),VLOOKUP(A8,Totals!$B$1:$C$359,2),\"LINE NUMBER?\"))","v":""},1.0]
{"$rows_left_out":6}